library
type: Class
label: library
comment: library containing books
label: bibliotheque @fr
comment: bibliotheque contenient des livres. @fr

book
type: Class
label: book
comment: written as a unit and designed as such made of paper or cardboard pages linked together.
label: livre @fr
comment: document écrit formant une unité et conçu comme tel composé de pages en papier ou en carton reliées les unes aux autres. @fr

comic
type: Class
sub class of: book
label: comic
comment: sort of book.
label: bd @fr
comment: juxtaposition de dessins articulés en séquences narratives @fr

title
type: Property
domain: book
label: title
label: titre @fr
comment: book title.
comment: titre du livre. @fr

volume
type: Property
domain: book
label: volume
label: tome @fr
comment: volume number.
comment: numéro du tome. @fr

legalDeposit
type: Property
domain: book
label: legalDeposit
label: depotLegal @fr
comment: legal deposit.
comment: depot legal. @fr

publicationyear
type: Property
domain: book
label: publicationyear
label: anneePublication @fr
comment: year of publication.
comment: année de publication. @fr

tableNumber
type: Property
domain: comic
label: tableNumber
label: nombrePlanche @fr
comment: table number.
comment: nombre de planches. @fr

price
type: Property
domain: book
label: price
label: prix @fr
comment: price.
comment: prix. @fr

priceLow
type: Property
domain: book
label: priceLow
label: prixBas @fr
comment: price low.
comment: prix bas. @fr

priceHigh
type: Property
domain: book
label: priceHigh
label: prixHaut @fr
comment: price high.
comment: prix haut. @fr

isbn
type: Property
domain: book
label: isbn
comment: unique worldwide book id.
comment: identifiant unique mondial du livre. @fr

id
type: Property
domain: book
label: id
comment: unique id.
comment: identifiant unique. @fr

serie
type: Class
label: serie
comment: serie of something.
comment: serie de quelque chose. @fr

collection
type: Class
label: collection
comment: collection.

humanBeing
type: Class
label: humanBeing
label: etreHumain @fr
comment: human being.
comment: etre humain. @fr

editor
type: Class
label: editor
comment: editeur.

format
type: Class
label: format
comment: format.

hasLibrairy
type: Property
domain: book
range: library
label: has for library
comment: relation between a book and a library.
label: a pour librairie @fr
comment: relation entre un livre et une librairie. @fr

hasSerie
type: Property
domain: comic
range: serie
label: has for serie
comment: relation between a comic and a serie.
label: a pour librairie @fr
comment: relation entre une bd et une serie. @fr

hasCollection
type: Property
domain: comic
range: collection
label: has for collection
comment: relation between a comic and a collection.
label: a pour collection @fr
comment: relation entre une bd et une collection. @fr

hasScenarist
type: Property
domain: comic
range: humanBeing
label: has for scenarist
comment: relation between a comic and a scenarist.
label: a pour senatiste @fr
comment: relation entre une bd et un scenariste. @fr

hasDesigner
type: Property
domain: comic
range: humanBeing
label: has for designer
comment: relation between a comic and a designer.
label: a pour dessinateur @fr
comment: relation entre une bd et un dessinateur. @fr

hasColorist
type: Property
domain: comic
range: humanBeing
label: has for colorist
comment: relation between a comic and a colorist.
label: a pour dessinateur @fr
comment: relation entre une bd et un dessinateur. @fr

hasEditor
type: Property
domain: comic
range: editor
label: has for editor
comment: relation between a comic and a editor.
label: a pour editeur @fr
comment: relation entre une bd et un editeur. @fr

hasFormat
type: Property
domain: comic
range: format
label: has for format
comment: relation between a comic and a format.
label: a pour format @fr
comment: relation entre une bd et une format. @fr

hasSuccessor
type: Property
domain: comic
range: comic
label: has for successor
comment: relation between a comic and is successor.
label: a pour successeur @fr
comment: relation entre une bd et son successeur. @fr